BDBM148413 US9682963, 6
SMILES NCc1ccc(cc1-c1cccc(c1)C(=O)Nc1ccc(SC2CCOC2=O)cc1)C(=O)Nc1ccncc1F
InChI Key InChIKey=SDKBJLOZUDMNKK-UHFFFAOYSA-N
Data  1 IC50  1 EC50
  Tab Delimited (TSV)   2D SDfile   Computed 3D by Vconf -m prep SDfile
Find this compound or compounds like it in BindingDB:
Activity Spreadsheet -- Enzyme Inhibition Constant Data from BindingDB
Found 2 hits for monomerid = 148413
TargetRho-associated protein kinase 2(Homo sapiens (Human))
Redx Pharma
US Patent
LigandPNGBDBM148413(US9682963, 6)
Affinity DataIC50: <100nMpH: 7.5 T: 2°C. Assay description: Base Reaction buffer; 20 mM Hepes (pH 7.5), 10 mM MgCl2, 1 mM EGTA, 0.02% Brij35, 0.02 mg/ml BSA, 0.1 mM Na3VO4, 2 mM DTT, 1% DMSO. Required cofactor...
Ligand InfoPC cidPC sid
In DepthDetails US Patent
TargetRho-associated protein kinase 1/2(Rattus norvegicus (Rat))
Redx Pharma
US Patent
LigandPNGBDBM148413(US9682963, 6)
Affinity DataEC50: <100nM. Assay description: Rat smooth muscle cell line A7r5 is used. The endogenous expression of ROCK results in a constitutive phosphorylation of the regulatory myosin light ...
Ligand InfoPC cidPC sid
In DepthDetails US Patent