BDBM149140 US8962648, 1209
SMILES CCC(CC)(CN)c1ccc(cc1)-c1c(O)ccc2[nH]c(=O)c3sccc3c12
InChI Key InChIKey=DEBMIAYJWDJBLR-UHFFFAOYSA-N
Data  1 IC50
  Tab Delimited (TSV)   2D SDfile   Computed 3D by Vconf -m prep SDfile
Find this compound or compounds like it in BindingDB:
Activity Spreadsheet -- Enzyme Inhibition Constant Data from BindingDB
Found 1 hit for monomerid = 149140
TargetLymphokine-activated killer T-cell-originated protein kinase(Homo sapiens (Human))
Oncotherapy Science
US Patent
LigandPNGBDBM149140(US8962648, 1209)
Affinity DataIC50:  1.80nMpH: 7.4 T: 2°C. Assay description: PBK activity was determined in the presence or absence of compounds using fluorescein isothiocyanate-labeled (FITC-labeled) histone H3 peptide as a s...
In DepthDetails US Patent