BDBM150178 US8980904, 3
SMILES COc1ccc(COc2nc(ncc2C(=O)NCc2ncccn2)N2CC3CC3C2)cc1Cl
InChI Key InChIKey=ZNPNIDSHHUSEAF-UHFFFAOYSA-N
Data  1 IC50
  Tab Delimited (TSV)   2D SDfile   Computed 3D by Vconf -m prep SDfile
Find this compound or compounds like it in BindingDB:
Activity Spreadsheet -- Enzyme Inhibition Constant Data from BindingDB
Found 1 hit for monomerid = 150178
TargetcGMP-specific 3',5'-cyclic phosphodiesterase(Homo sapiens (Human))
Xuanzhu Pharma
US Patent
LigandPNGBDBM150178(US8980904, 3)
Affinity DataIC50:  0.100nMpH: 7.5 T: 2°C. Assay description: A sample to be tested is precisely weighed, dissolved by adding DMSO, mixed sufficiently to form 10 mM solution. The above mother solution is diluted...
In DepthDetails US Patent