BDBM150803 2-(3-((4-Amino-2-methylpyrimidin-5-yl)methyl)phenyl)ethanol (8)
SMILES Cc1ncc(Cc2cccc(CCO)c2)c(N)n1
InChI Key InChIKey=CLAXVJRRXGSGJP-UHFFFAOYSA-N
Data  1 Kd
PDB links: 2 PDB IDs match this monomer.
  Tab Delimited (TSV)   2D SDfile   Computed 3D by Vconf -m prep SDfile
Find this compound or compounds like it in BindingDB:
Activity Spreadsheet -- Enzyme Inhibition Constant Data from BindingDB
Found 1 hit for monomerid = 150803
TargetThiamine transporter ThiT(Lactococcus lactis (Firmicutes))
University of Groningen
LigandPNGBDBM150803(2-(3-((4-Amino-2-methylpyrimidin-5-yl)methyl)pheny...)
Affinity DataKd:  528nM. Assay description: Purified ThiT was diluted in buffer E to a concentration of ~50 nM in a final volume of 800 µL. The substrates were added in 1 µL steps. Using an exc...