BDBM151038 BDBM151081::US8987268, 52
SMILES COc1ccc(cn1)-c1cc2c(N[C@@H]3CN(C[C@@H]3C)C(=O)CC#N)c(cnn2c1)C(N)=O
InChI Key InChIKey=XSPQKSHLJRAQGA-SUMWQHHRSA-N
Data  4 IC50
  Tab Delimited (TSV)   2D SDfile   Computed 3D by Vconf -m prep SDfile
Find this compound or compounds like it in BindingDB:
Activity Spreadsheet -- Enzyme Inhibition Constant Data from BindingDB
Found 4 hits for monomerid = 151038
TargetTyrosine-protein kinase JAK3(Homo sapiens (Human))
Bristol-Myers Squibb
US Patent
LigandPNGBDBM151038(BDBM151081 | US8987268, 52)
Affinity DataIC50:  2.20nMpH: 7.4 T: 2°C. Assay description: The assay reactions were performed in U-bottom 384-well plates. The final assay volume was 30 ul prepared from 15 ul additions of enzyme and substrat...
In DepthDetails US Patent
TargetTyrosine-protein kinase JAK1(Homo sapiens (Human))
Bristol-Myers Squibb
US Patent
LigandPNGBDBM151038(BDBM151081 | US8987268, 52)
Affinity DataIC50:  1.60nMpH: 7.4 T: 2°C. Assay description: The assay reactions were performed in U-bottom 384-well plates. The final assay volume was 30 ul prepared from 15 ul additions of enzyme and substrat...
In DepthDetails US Patent
TargetTyrosine-protein kinase JAK1(Homo sapiens (Human))
Bristol-Myers Squibb
US Patent
LigandPNGBDBM151038(BDBM151081 | US8987268, 52)
Affinity DataIC50:  1.70nMpH: 7.4 T: 2°C. Assay description: The assay reactions were performed in U-bottom 384-well plates. The final assay volume was 30 ul prepared from 15 ul additions of enzyme and substrat...
In DepthDetails US Patent
TargetTyrosine-protein kinase JAK3(Homo sapiens (Human))
Bristol-Myers Squibb
US Patent
LigandPNGBDBM151038(BDBM151081 | US8987268, 52)
Affinity DataIC50:  1.40nMpH: 7.4 T: 2°C. Assay description: The assay reactions were performed in U-bottom 384-well plates. The final assay volume was 30 ul prepared from 15 ul additions of enzyme and substrat...
In DepthDetails US Patent