BDBM151041 US8987268, 60
SMILES C[C@H]1[C@@H](C[C@@H]2CN(C[C@H]12)S(C)(=O)=O)Nc1c(cnn2cc(cc12)N1CCN(C(C)=O)C1=O)C(N)=O
InChI Key InChIKey=ORTGRWHHDWNTIU-AXYPVASZSA-N
Data  2 IC50
  Tab Delimited (TSV)   2D SDfile   Computed 3D by Vconf -m prep SDfile
Find this compound or compounds like it in BindingDB:
Activity Spreadsheet -- Enzyme Inhibition Constant Data from BindingDB
Found 2 hits for monomerid = 151041
TargetTyrosine-protein kinase JAK1(Homo sapiens (Human))
Bristol-Myers Squibb
US Patent
LigandPNGBDBM151041(US8987268, 60)
Affinity DataIC50:  0.800nMpH: 7.4 T: 2°C. Assay description: The assay reactions were performed in U-bottom 384-well plates. The final assay volume was 30 ul prepared from 15 ul additions of enzyme and substrat...
Ligand InfoPC cidPC sid
In DepthDetails US Patent
TargetTyrosine-protein kinase JAK3(Homo sapiens (Human))
Bristol-Myers Squibb
US Patent
LigandPNGBDBM151041(US8987268, 60)
Affinity DataIC50:  1.80nMpH: 7.4 T: 2°C. Assay description: The assay reactions were performed in U-bottom 384-well plates. The final assay volume was 30 ul prepared from 15 ul additions of enzyme and substrat...
Ligand InfoPC cidPC sid
In DepthDetails US Patent