BDBM151063 US8987268, 184
SMILES C[C@H]1CN(C[C@H]1Nc1c(cnn2cc(cc12)-c1cnn(CC(=O)N2CC(F)(F)C2)c1)C(N)=O)c1ccc(cn1)C#N
InChI Key InChIKey=DYNWNZXMEXKEQG-HRAATJIYSA-N
Data  2 IC50
  Tab Delimited (TSV)   2D SDfile   Computed 3D by Vconf -m prep SDfile
Find this compound or compounds like it in BindingDB:
Activity Spreadsheet -- Enzyme Inhibition Constant Data from BindingDB
Found 2 hits for monomerid = 151063
TargetTyrosine-protein kinase JAK1(Homo sapiens (Human))
Bristol-Myers Squibb
US Patent
LigandPNGBDBM151063(US8987268, 184)
Affinity DataIC50:  0.200nMpH: 7.4 T: 2°C. Assay description: The assay reactions were performed in U-bottom 384-well plates. The final assay volume was 30 ul prepared from 15 ul additions of enzyme and substrat...
In DepthDetails US Patent
TargetTyrosine-protein kinase JAK3(Homo sapiens (Human))
Bristol-Myers Squibb
US Patent
LigandPNGBDBM151063(US8987268, 184)
Affinity DataIC50:  0.400nMpH: 7.4 T: 2°C. Assay description: The assay reactions were performed in U-bottom 384-well plates. The final assay volume was 30 ul prepared from 15 ul additions of enzyme and substrat...
In DepthDetails US Patent