BDBM151073 US8987268, 280
SMILES COc1ncc(cn1)-c1cc2c(N[C@@H]3CN(C[C@@H]3CF)C(=O)C3(CC3)C#N)c(cnn2c1)C(N)=O
InChI Key InChIKey=GVCOQGZPNLFXGH-WMLDXEAASA-N
Data  2 IC50
  Tab Delimited (TSV)   2D SDfile   Computed 3D by Vconf -m prep SDfile
Find this compound or compounds like it in BindingDB:
Activity Spreadsheet -- Enzyme Inhibition Constant Data from BindingDB
Found 2 hits for monomerid = 151073
TargetTyrosine-protein kinase JAK1(Homo sapiens (Human))
Bristol-Myers Squibb
US Patent
LigandPNGBDBM151073(US8987268, 280)
Affinity DataIC50:  0.900nMpH: 7.4 T: 2°C. Assay description: The assay reactions were performed in U-bottom 384-well plates. The final assay volume was 30 ul prepared from 15 ul additions of enzyme and substrat...
In DepthDetails US Patent
TargetTyrosine-protein kinase JAK3(Homo sapiens (Human))
Bristol-Myers Squibb
US Patent
LigandPNGBDBM151073(US8987268, 280)
Affinity DataIC50:  8.90nMpH: 7.4 T: 2°C. Assay description: The assay reactions were performed in U-bottom 384-well plates. The final assay volume was 30 ul prepared from 15 ul additions of enzyme and substrat...
In DepthDetails US Patent