BDBM15230 4-[4-({[(3S,4R,5R)-3,4,5-trihydroxyoxan-2-yl]oxy}methyl)-1H-1,2,3-triazol-1-yl]benzene-1-sulfonamide::4-{4-[(D-arabinopyranosyloxy)methyl]-1H-1,2,3-triazol-1-yl}benzenesulfonamide::glycoconjugate sulfonamide 14
SMILES NS(=O)(=O)c1ccc(cc1)-n1cc(COC2OC[C@@H](O)[C@@H](O)[C@@H]2O)nn1
InChI Key InChIKey=UJXRTXMHXLXLOL-HABKJSAYSA-N
Data  3 KI
  Tab Delimited (TSV)   2D SDfile   Computed 3D by Vconf -m prep SDfile
Find this compound or compounds like it in BindingDB:
Activity Spreadsheet -- Enzyme Inhibition Constant Data from BindingDB
Found 3 hits for monomerid = 15230
TargetCarbonic anhydrase 2(Homo sapiens (Human))
Griffith University
LigandPNGBDBM15230(4-[4-({[(3S,4R,5R)-3,4,5-trihydroxyoxan-2-yl]oxy}m...)
Affinity DataKi:  6.90nM. Assay description: An Applied Photophysics stopped-flow instrument has been used for assaying the CA-catalyzed CO2 hydration activity. Phenol red has been used as indic...
In DepthDetails ArticlePubMed
TargetCarbonic anhydrase 1(Homo sapiens (Human))
Griffith University
LigandPNGBDBM15230(4-[4-({[(3S,4R,5R)-3,4,5-trihydroxyoxan-2-yl]oxy}m...)
Affinity DataKi:  8.5nM ΔG°:  -11.0kcal/molepH: 7.5 T: 2°C. Assay description: An Applied Photophysics stopped-flow instrument has been used for assaying the CA-catalyzed CO2 hydration activity. Phenol red has been used as indic...
In DepthDetails ArticlePubMed
TargetCarbonic anhydrase 9(Homo sapiens (Human))
Griffith University
LigandPNGBDBM15230(4-[4-({[(3S,4R,5R)-3,4,5-trihydroxyoxan-2-yl]oxy}m...)
Affinity DataKi:  103nM. Assay description: An Applied Photophysics stopped-flow instrument has been used for assaying the CA-catalyzed CO2 hydration activity. Phenol red has been used as indic...
In DepthDetails ArticlePubMed