BDBM153112 US8993631, 14-1::US9006249, Example 1-1::US9603819, Example 1-1
SMILES C[C@H](C[C@@H](Cc1ccc(cc1)-c1ccccc1)NC(=O)c1cccc(c1)C(O)=O)C(O)=O
InChI Key InChIKey=CXDCBPLMHAFCCH-HXOBKFHXSA-N
Data  3 IC50
  Tab Delimited (TSV)   2D SDfile   Computed 3D by Vconf -m prep SDfile
Find this compound or compounds like it in BindingDB:
Activity Spreadsheet -- Enzyme Inhibition Constant Data from BindingDB
Found 1 hit for monomerid = 153112
TargetNeprilysin(Homo sapiens (Human))
Novartis
US Patent
LigandPNGBDBM153112(US8993631, 14-1 | US9006249, Example 1-1 | US96038...)
Affinity DataIC50:  283nMpH: 7.4 T: 2°C. Assay description: See A fluorescence lifetime-based assay for protease inhibitor profiling on human kallikrein 7 Doering K, Meder G, Hinnenberger M, Woelcke J, Mayr L ...
Ligand InfoPC cidPC sid
In DepthDetails US Patent