BDBM15417 1,3-diethyl-5-(4-phenyl-1H-imidazol-5-yl)-2,3-dihydro-1H-1,3-benzodiazol-2-one::benzimidazolone 12c
SMILES CCn1c2ccc(cc2n(CC)c1=O)-c1nc[nH]c1-c1ccccc1
InChI Key InChIKey=FCDUOXMHWBYUNK-UHFFFAOYSA-N
Data  1 IC50
  Tab Delimited (TSV)   2D SDfile   Computed 3D by Vconf -m prep SDfile
Find this compound or compounds like it in BindingDB:
Activity Spreadsheet -- Enzyme Inhibition Constant Data from BindingDB
Found 1 hit for monomerid = 15417
TargetMitogen-activated protein kinase 14(Homo sapiens (Human))
Pfizer
LigandPNGBDBM15417(1,3-diethyl-5-(4-phenyl-1H-imidazol-5-yl)-2,3-dihy...)
Affinity DataIC50:  140nMpH: 7.2 T: 2°C. Assay description: The IC50s were determined by incubating each test compound with activated p38-alpha in a 96-well plate that had been pre-treated with ATF-2-GST to al...
In DepthDetails ArticlePubMed