BDBM15437 1,3-dimethyl-5-[4-(3-methylphenyl)-2-(pyridin-3-yl)-1H-imidazol-5-yl]-2,3-dihydro-1H-1,3-benzodiazol-2-one::benzimidazolone 12w
SMILES Cc1cccc(c1)-c1[nH]c(nc1-c1ccc2n(C)c(=O)n(C)c2c1)-c1cccnc1
InChI Key InChIKey=DNTYLQGBZLGVPF-UHFFFAOYSA-N
Data  1 IC50
  Tab Delimited (TSV)   2D SDfile   Computed 3D by Vconf -m prep SDfile
Find this compound or compounds like it in BindingDB:
Activity Spreadsheet -- Enzyme Inhibition Constant Data from BindingDB
Found 1 hit for monomerid = 15437
TargetMitogen-activated protein kinase 14(Homo sapiens (Human))
Pfizer
LigandPNGBDBM15437(1,3-dimethyl-5-[4-(3-methylphenyl)-2-(pyridin-3-yl...)
Affinity DataIC50:  200nM. Assay description: The IC50s were determined by incubating each test compound with activated p38-alpha in a 96-well plate that had been pre-treated with ATF-2-GST to al...
In DepthDetails ArticlePubMed