BDBM15444 1,3-dimethyl-5-(3-phenyl-1H-pyrazol-4-yl)-2,3-dihydro-1H-1,3-benzodiazol-2-one::benzimidazolone 16c
SMILES Cn1c2ccc(cc2n(C)c1=O)-c1c[nH]nc1-c1ccccc1
InChI Key InChIKey=ROBTXVKYMUGJDK-UHFFFAOYSA-N
Data  1 IC50
  Tab Delimited (TSV)   2D SDfile   Computed 3D by Vconf -m prep SDfile
Find this compound or compounds like it in BindingDB:
Activity Spreadsheet -- Enzyme Inhibition Constant Data from BindingDB
Found 1 hit for monomerid = 15444
TargetMitogen-activated protein kinase 14(Homo sapiens (Human))
Pfizer
LigandPNGBDBM15444(1,3-dimethyl-5-(3-phenyl-1H-pyrazol-4-yl)-2,3-dihy...)
Affinity DataIC50:  200nM. Assay description: The IC50s were determined by incubating each test compound with activated p38-alpha in a 96-well plate that had been pre-treated with ATF-2-GST to al...
In DepthDetails ArticlePubMed