BDBM15449 1,3-diethyl-5-[4-(3-methylphenyl)-1H-pyrazol-3-yl]-2,3-dihydro-1H-1,3-benzodiazol-2-one::benzimidazolone 17c
SMILES CCn1c2ccc(cc2n(CC)c1=O)-c1n[nH]cc1-c1cccc(C)c1
InChI Key InChIKey=YSSLVAIAOGYOQF-UHFFFAOYSA-N
Data  1 IC50
  Tab Delimited (TSV)   2D SDfile   Computed 3D by Vconf -m prep SDfile
Find this compound or compounds like it in BindingDB:
Activity Spreadsheet -- Enzyme Inhibition Constant Data from BindingDB
Found 1 hit for monomerid = 15449
TargetMitogen-activated protein kinase 14(Homo sapiens (Human))
Pfizer
LigandPNGBDBM15449(1,3-diethyl-5-[4-(3-methylphenyl)-1H-pyrazol-3-yl]...)
Affinity DataIC50:  730nM. Assay description: The IC50s were determined by incubating each test compound with activated p38-alpha in a 96-well plate that had been pre-treated with ATF-2-GST to al...
In DepthDetails ArticlePubMed