BDBM15457 2-(4-fluorophenyl)-4-methoxy-3-(pyridin-4-yl)-1H-pyrrolo[2,3-b]pyridin-6-amine::2-(4-fluorophenyl)-4-methoxy-3-pyridin-4-yl-1H-pyrrolo[2,3-b]pyridin-6-amine::CHEMBL115769::RWJ-68354
SMILES COc1cc(N)nc2[nH]c(c(-c3ccncc3)c12)-c1ccc(F)cc1
InChI Key InChIKey=ADQZGIYHFQQPRB-UHFFFAOYSA-N
Data  3 IC50
  Tab Delimited (TSV)   2D SDfile   Computed 3D by Vconf -m prep SDfile
Find this compound or compounds like it in BindingDB:
Activity Spreadsheet -- Enzyme Inhibition Constant Data from BindingDB
Found 3 hits for monomerid = 15457
TargetMitogen-activated protein kinase 14(Homo sapiens (Human))
Pfizer
LigandPNGBDBM15457(2-(4-fluorophenyl)-4-methoxy-3-(pyridin-4-yl)-1H-p...)
Affinity DataIC50:  52nM. Assay description: The IC50s were determined by incubating each test compound with activated p38-alpha in a 96-well plate that had been pre-treated with ATF-2-GST to al...
In DepthDetails ArticlePubMed
TargetMitogen-activated protein kinase 11/12/13/14(Homo sapiens (Human))
Johnson & Johnson Pharmaceutical Research And Development
Curated by ChEMBL
LigandPNGBDBM15457(2-(4-fluorophenyl)-4-methoxy-3-(pyridin-4-yl)-1H-p...)
Affinity DataIC50:  7nM. Assay description: Inhibition of LPS-induced p38-related TNF-alpha production in human peripheral blood mononuclear cells
In DepthDetails ArticlePubMed
TargetMitogen-activated protein kinase 14(Mus musculus (mouse))
Johnson & Johnson Pharmaceutical Research And Development
Curated by ChEMBL
LigandPNGBDBM15457(2-(4-fluorophenyl)-4-methoxy-3-(pyridin-4-yl)-1H-p...)
Affinity DataIC50:  1.50E+3nM. Assay description: Inhibition of murine p38 alpha kinase
In DepthDetails ArticlePubMed