BDBM15467 4-[(3R)-3-{[2-(4-chlorophenyl)-2-oxoethyl]amino}butyl]benzamide::aryl ketone deriv. 8
SMILES C[C@H](CCc1ccc(cc1)C(N)=O)NCC(=O)c1ccc(Cl)cc1
InChI Key InChIKey=SFVFCCXCBNGYQT-CYBMUJFWSA-N
Data  1 IC50
  Tab Delimited (TSV)   2D SDfile   Computed 3D by Vconf -m prep SDfile
Find this compound or compounds like it in BindingDB:
Activity Spreadsheet -- Enzyme Inhibition Constant Data from BindingDB
Found 1 hit for monomerid = 15467
TargetDipeptidyl peptidase 4(Homo sapiens (Human))
Eli Lilly
LigandPNGBDBM15467(4-[(3R)-3-{[2-(4-chlorophenyl)-2-oxoethyl]amino}bu...)
Affinity DataIC50:  820nMpH: 7.5 T: 2°C. Assay description: The DPP activity resulted in the formation of the fluorescent product amidomethylcoumarin (AMC), which was monitored by excitation at 355 nm and meas...
In DepthDetails ArticlePubMed