BDBM15576 (2R,3R)-3-amino-2-[4-(4-fluorophenyl)phenyl]-4-[(3S)-3-fluoropyrrolidin-1-yl]-N,N-dimethyl-4-oxobutanamide::DPP-4 ligand 18
SMILES CN(C)C(=O)[C@@H]([C@@H](N)C(=O)N1CC[C@H](F)C1)c1ccc(cc1)-c1ccc(F)cc1
InChI Key InChIKey=YPGNHGMZLLVIHB-XUVXKRRUSA-N
Data  1 IC50
  Tab Delimited (TSV)   2D SDfile   Computed 3D by Vconf -m prep SDfile
Find this compound or compounds like it in BindingDB:
Activity Spreadsheet -- Enzyme Inhibition Constant Data from BindingDB
Found 1 hit for monomerid = 15576
TargetDipeptidyl peptidase 4(Homo sapiens (Human))
Merck Research Laboratories
LigandPNGBDBM15576((2R,3R)-3-amino-2-[4-(4-fluorophenyl)phenyl]-4-[(3...)
Affinity DataIC50:  1.46E+3nMpH: 7.5 T: 2°C. Assay description: The enzyme activity resulted in the formation of the fluorescent product amidomethylcoumarin (AMC), which was monitored by excitation at 360 nm and m...
In DepthDetails ArticlePubMed