BDBM155979 US9018214, 30
SMILES C[C@@H]1CN(CC(=O)N2CCc3ccc(cc23)S(C)(=O)=O)CCN1
InChI Key InChIKey=ZTMPEYVVEBGYEB-GFCCVEGCSA-N
Data  3 IC50
  Tab Delimited (TSV)   2D SDfile   Computed 3D by Vconf -m prep SDfile
Find this compound or compounds like it in BindingDB:
Activity Spreadsheet -- Enzyme Inhibition Constant Data from BindingDB
Found 3 hits for monomerid = 155979
TargetE3 ubiquitin-protein ligase XIAP(Homo sapiens (Human))
Astex Therapeutics
US Patent
LigandPNGBDBM155979(US9018214, 30)
Affinity DataIC50:  4.10E+3nMpH: 7.5 T: 2°C. Assay description: Modified SMAC peptides and compounds were tested for their ability to displace the fluorescent tracer from either XIAP, clAP-1 or clAP-2. BIR3 domain...
In DepthDetails US Patent
TargetE3 ubiquitin-protein ligase XIAP(Homo sapiens (Human))
Astex Therapeutics
US Patent
LigandPNGBDBM155979(US9018214, 30)
Affinity DataIC50:  4.10nM. Assay description: Inhibition of XIAP BIR3 domain (unknown origin)
In DepthDetails PubMed
TargetE3 ubiquitin-protein ligase XIAP(Homo sapiens (Human))
Astex Therapeutics
US Patent
LigandPNGBDBM155979(US9018214, 30)
Affinity DataIC50:  4.10E+3nM. Assay description: Antagonist activity at XIAP-BIR3 domain (unknown origin) assessed as inhibition of interaction with SMAC by fluorescence polarization assay
In DepthDetails ArticlePubMed