BDBM156310 US9018217, 2-(1-Methyl-4-phenyl-1H-imidazol-2-ylmethylsulfanyl)-[1,2,4]triazolo[1,5-a]pyrimidine::US9592230, 2-(1-Methyl-4-phenyl-1H-imidazol-2-ylmethylsulfanyl)-[1,2,4]triazolo[1,5-a]pyrimidine
SMILES Cn1cc(nc1CSc1nc2ncccn2n1)-c1ccccc1
InChI Key InChIKey=YXIMAWLSBBBXSY-UHFFFAOYSA-N
Data  2 IC50
  Tab Delimited (TSV)   2D SDfile   Computed 3D by Vconf -m prep SDfile
Find this compound or compounds like it in BindingDB:
Activity Spreadsheet -- Enzyme Inhibition Constant Data from BindingDB
Found 2 hits for monomerid = 156310
TargetcAMP and cAMP-inhibited cGMP 3',5'-cyclic phosphodiesterase 10A(Homo sapiens (Human))
H. Lundbeck
US Patent
LigandPNGBDBM156310(US9018217, 2-(1-Methyl-4-phenyl-1H-imidazol-2-ylme...)
Affinity DataIC50:  1.50E+3nM. Assay description: A PDE10A assay may for example, be performed as follows: The assay is performed in 60 uL samples containing a fixed amount of the relevant PDE enzyme...
In DepthDetails US Patent
TargetcAMP and cAMP-inhibited cGMP 3',5'-cyclic phosphodiesterase 10A(Homo sapiens (Human))
H. Lundbeck
US Patent
LigandPNGBDBM156310(US9018217, 2-(1-Methyl-4-phenyl-1H-imidazol-2-ylme...)
Affinity DataIC50:  1.50E+3nMT: 2°C. Assay description: A PDE10A assay may for example, be performed as follows: The assay is performed in 60 uL samples containing a fixed amount of the relevant PDE enzyme...
In DepthDetails US Patent