BDBM158247 US9029370, 41
SMILES Clc1ccc(NC(=O)Nc2ccc(cc2Cl)C2CCCNC2)cn1
InChI Key InChIKey=VPCILIVSNHJPLB-UHFFFAOYSA-N
Data  2 KI
  Tab Delimited (TSV)   2D SDfile   Computed 3D by Vconf -m prep SDfile
Find this compound or compounds like it in BindingDB:
Activity Spreadsheet -- Enzyme Inhibition Constant Data from BindingDB
Found 2 hits for monomerid = 158247
TargetTrace amine-associated receptor 1(Mus musculus (Mouse))
Hoffmann-La Roche
US Patent
LigandPNGBDBM158247(US9029370, 41)
Affinity DataKi:  1.5nM ΔG°:  -12.5kcal/molepH: 7.4 T: 2°C. Assay description: Membrane Preparation and Radioligand Binding. HEK-293 cells stably expressing mouse TAA 1 were maintained at 37 C and 5% C02 in DMEM high glucose med...
In DepthDetails US Patent
TargetTrace amine-associated receptor 1(Rattus norvegicus (Rat))
Hoffmann-La Roche
US Patent
LigandPNGBDBM158247(US9029370, 41)
Affinity DataKi:  9nM ΔG°:  -11.4kcal/molepH: 7.4 T: 2°C. Assay description: HEK-293 cells stably expressing rat TAAR1 were maintained at 37 C and 5% CO2 in DMEM high glucose medium, containing fetal calf serum (10%, heat inac...
In DepthDetails US Patent