BDBM16026 N-[(2S,3R)-4-(cyclopropylamino)-3-hydroxy-1-phenylbutan-2-yl]-3-(N-methylmethanesulfonamido)-5-(1-phenylethenyl)benzamide::isophthalamide deriv. 7g
SMILES CN(c1cc(cc(c1)C(=C)c1ccccc1)C(=O)N[C@@H](Cc1ccccc1)[C@H](O)CNC1CC1)S(C)(=O)=O
InChI Key InChIKey=SWKGNUNVEFSXTN-URLMMPGGSA-N
Data  1 IC50
  Tab Delimited (TSV)   2D SDfile   Computed 3D by Vconf -m prep SDfile
Find this compound or compounds like it in BindingDB:
Activity Spreadsheet -- Enzyme Inhibition Constant Data from BindingDB
Found 1 hit for monomerid = 16026
TargetBeta-secretase 1(Homo sapiens (Human))
Merck Research Laboratories
LigandPNGBDBM16026(N-[(2S,3R)-4-(cyclopropylamino)-3-hydroxy-1-phenyl...)
Affinity DataIC50:  1.30E+3nMpH: 4.5 T: 2°C. Assay description: The assay was performed using a 96-well format on a HPLC equipped with four 96-well plate holders. Test compounds were preincubated with enzymes for ...
In DepthDetails ArticlePubMed