BDBM16057 (2S)-N-[(1S)-1-{[(1S,2S)-1-[(1R,2R)-2-{[(1S)-1-(butylcarbamoyl)-2-methylpropyl]carbamoyl}-4-oxocyclopentyl]-1-hydroxy-4-methylpentan-2-yl]carbamoyl}-3-(methylsulfanyl)propyl]-2-acetamido-4-methylpentanamide::N-acetyl-L-leucyl-N-{(1S)-1-[(S)-[(1R,2R)-2-{[(1S)-1-(butylcarbamoyl)-2-methylpropyl]carbamoyl}-4-oxocyclopentyl](hydroxy)methyl]-3-methylbutyl}-L-methioninamide::NVP-AUR200::Val-NHBu deriv. 45
SMILES [H][C@]1(CC(=O)C[C@H]1C(=O)N[C@@H](C(C)C)C(=O)NCCCC)[C@H](O)[C@H](CC(C)C)NC(=O)[C@H](CCSC)NC(=O)[C@H](CC(C)C)NC(C)=O
InChI Key InChIKey=YFDLSIPCLMLOKZ-WKXXOEGVSA-N
Data  2 IC50
PDB links: 1 PDB ID matches this monomer.
  Tab Delimited (TSV)   2D SDfile   Computed 3D by Vconf -m prep SDfile
Find this compound or compounds like it in BindingDB:
Activity Spreadsheet -- Enzyme Inhibition Constant Data from BindingDB
Found 2 hits for monomerid = 16057
TargetCathepsin D(Homo sapiens (Human))
Universite De Montreal At Succursale Centre-Ville
LigandPNGBDBM16057((2S)-N-[(1S)-1-{[(1S,2S)-1-[(1R,2R)-2-{[(1S)-1-(bu...)
Affinity DataIC50:  56nMT: 2°C. Assay description: Inhibition assays were done in black 96-well plates by adding test compounds to the respective enzyme in assay buffer. Plates were incubated at room ...
In DepthDetails ArticlePubMed
TargetBeta-secretase 1 [1-453](Homo sapiens (Human))
Universite De Montreal At Succursale Centre-Ville
LigandPNGBDBM16057((2S)-N-[(1S)-1-{[(1S,2S)-1-[(1R,2R)-2-{[(1S)-1-(bu...)
Affinity DataIC50:  10nMpH: 4.5 T: 2°C. Assay description: Inhibition assays were done in black 96-well plates by adding test compounds to the respective enzyme in assay buffer. Plates were incubated at room ...