BDBM160723 US9682980, 8-Chloro-3-neopentyl-7-(4-(pyrimidin-2-yl)piperazin-1-yl)-[1,2,4]triazolo[4,3-b]pyridazine
SMILES CC(C)(C)Cc1nnc2c(Cl)c(cnn12)N1CCC(CC1)c1ncccn1
InChI Key InChIKey=JLOXPXLPSUADSH-UHFFFAOYSA-N
Data  1 EC50
  Tab Delimited (TSV)   2D SDfile   Computed 3D by Vconf -m prep SDfile
Find this compound or compounds like it in BindingDB:
Activity Spreadsheet -- Enzyme Inhibition Constant Data from BindingDB
Found 1 hit for monomerid = 160723
TargetMetabotropic glutamate receptor 2(Homo sapiens (Human))
Bristol-Myers Squibb
US Patent
LigandPNGBDBM160723(US9682980, 8-Chloro-3-neopentyl-7-(4-(pyrimidin-2-...)
Affinity DataEC50:  437nMpH: 7.0Assay Description:Clonally expressed human mGluR2 in HEK293 background was glutamate starved overnight in media without glutamine (GIBCO MEM 12360), containing 10% FBS...
Ligand InfoPC cidPC sid
In DepthDetails US Patent