BDBM160724 US9682980, 8-Chloro-3-(cyclopropylmethyl)-7-(4-(4-fluorophenyl)piperidin-1-yl)-[1,2,4]triazolo[4,3-b]pyridazine
SMILES Fc1ccc(cc1)C1CCN(CC1)c1cnn2c(CC3CC3)nnc2c1Cl
InChI Key InChIKey=WELJBRXWNGNTRK-UHFFFAOYSA-N
Data  1 EC50
  Tab Delimited (TSV)   2D SDfile   Computed 3D by Vconf -m prep SDfile
Find this compound or compounds like it in BindingDB:
Activity Spreadsheet -- Enzyme Inhibition Constant Data from BindingDB
Found 1 hit for monomerid = 160724
TargetMetabotropic glutamate receptor 2(Homo sapiens (Human))
Bristol-Myers Squibb
US Patent
LigandPNGBDBM160724(US9682980, 8-Chloro-3-(cyclopropylmethyl)-7-(4-(4-...)
Affinity DataEC50:  46nMpH: 7.0Assay Description:Clonally expressed human mGluR2 in HEK293 background was glutamate starved overnight in media without glutamine (GIBCO MEM 12360), containing 10% FBS...
Ligand InfoPC cidPC sid
In DepthDetails US Patent