BDBM160738 US9682980, 8-Chloro-3-(cyclopropylmethyl)-N-((1-(phenoxymethyl)cyclopropyl)methyl)-[1,2,4]triazolo[4,3-b]pyridazin-7-amine
SMILES Clc1c(NCC2(COc3ccccc3)CC2)cnn2c(CC3CC3)nnc12
InChI Key InChIKey=WYMSJNBDOXAXGV-UHFFFAOYSA-N
Data  1 EC50
  Tab Delimited (TSV)   2D SDfile   Computed 3D by Vconf -m prep SDfile
Find this compound or compounds like it in BindingDB:
Activity Spreadsheet -- Enzyme Inhibition Constant Data from BindingDB
Found 1 hit for monomerid = 160738
TargetMetabotropic glutamate receptor 2(Homo sapiens (Human))
Bristol-Myers Squibb
US Patent
LigandPNGBDBM160738(US9682980, 8-Chloro-3-(cyclopropylmethyl)-N-((1-(p...)
Affinity DataEC50:  2.31E+3nMpH: 7.0Assay Description:Clonally expressed human mGluR2 in HEK293 background was glutamate starved overnight in media without glutamine (GIBCO MEM 12360), containing 10% FBS...
Ligand InfoPC cidPC sid
In DepthDetails US Patent