BDBM160751 US9682980, 8-Chloro-3-(cyclopropylmethyl)-N-((2,3-dihydro-1H-inden-2-yl)methyl)-[1,2,4]triazolo[4,3-b]pyridazin-7-amine
SMILES Clc1c(NCC2Cc3ccccc3C2)cnn2c(CC3CC3)nnc12
InChI Key InChIKey=HYEMXXXKPJFAFT-UHFFFAOYSA-N
Data  1 EC50
  Tab Delimited (TSV)   2D SDfile   Computed 3D by Vconf -m prep SDfile
Find this compound or compounds like it in BindingDB:
Activity Spreadsheet -- Enzyme Inhibition Constant Data from BindingDB
Found 1 hit for monomerid = 160751
TargetMetabotropic glutamate receptor 2(Homo sapiens (Human))
Bristol-Myers Squibb
US Patent
LigandPNGBDBM160751(US9682980, 8-Chloro-3-(cyclopropylmethyl)-N-((2,3-...)
Affinity DataEC50:  21nMpH: 7.0Assay Description:Clonally expressed human mGluR2 in HEK293 background was glutamate starved overnight in media without glutamine (GIBCO MEM 12360), containing 10% FBS...
Ligand InfoPC cidPC sid
In DepthDetails US Patent