BDBM160754 US9682980, 8-Chloro-7-(4-(2,5-dimethoxyphenyl)piperidin-1-yl)-3-(2,2,2-trifluoroethyl)-[1,2,4]triazolo[4,3-b]pyridazine
SMILES COc1ccc(OC)c(c1)C1CCN(CC1)c1cnn2c(CC(F)(F)F)nnc2c1Cl
InChI Key InChIKey=OHFCZKSMGLMXPK-UHFFFAOYSA-N
Data  1 EC50
  Tab Delimited (TSV)   2D SDfile   Computed 3D by Vconf -m prep SDfile
Find this compound or compounds like it in BindingDB:
Activity Spreadsheet -- Enzyme Inhibition Constant Data from BindingDB
Found 1 hit for monomerid = 160754
TargetMetabotropic glutamate receptor 2(Homo sapiens (Human))
Bristol-Myers Squibb
US Patent
LigandPNGBDBM160754(US9682980, 8-Chloro-7-(4-(2,5-dimethoxyphenyl)pipe...)
Affinity DataEC50:  7nMpH: 7.0Assay Description:Clonally expressed human mGluR2 in HEK293 background was glutamate starved overnight in media without glutamine (GIBCO MEM 12360), containing 10% FBS...
Ligand InfoPC cidPC sid
In DepthDetails US Patent