BDBM160764 US9682980, 8-Chloro-7-(4-(2-chlorophenyl)piperidin-1-yl)-3-(2,2,2-trifluoroethyl)-[1,2,4]triazolo[4,3-b]pyridazine
SMILES FC(F)(F)Cc1nnc2c(Cl)c(cnn12)N1CCC(CC1)c1ccccc1Cl
InChI Key InChIKey=SSBYIMVBVSAQRH-UHFFFAOYSA-N
Data  1 EC50
  Tab Delimited (TSV)   2D SDfile   Computed 3D by Vconf -m prep SDfile
Find this compound or compounds like it in BindingDB:
Activity Spreadsheet -- Enzyme Inhibition Constant Data from BindingDB
Found 1 hit for monomerid = 160764
TargetMetabotropic glutamate receptor 2(Homo sapiens (Human))
Bristol-Myers Squibb
US Patent
LigandPNGBDBM160764(US9682980, 8-Chloro-7-(4-(2-chlorophenyl)piperidin...)
Affinity DataEC50:  48nMpH: 7.0Assay Description:Clonally expressed human mGluR2 in HEK293 background was glutamate starved overnight in media without glutamine (GIBCO MEM 12360), containing 10% FBS...
Ligand InfoPC cidPC sid
In DepthDetails US Patent