BDBM160835 US9682976, 6
SMILES CC(C)N1CCC(CC1)Oc1ccc(Nc2ncc(F)c(NC3CC4CCCN4C(C)(C)C3)n2)cc1OC(F)F
InChI Key InChIKey=HOCYSKMLCFDQRG-UHFFFAOYSA-N
Data  1 EC50
  Tab Delimited (TSV)   2D SDfile   Computed 3D by Vconf -m prep SDfile
Find this compound or compounds like it in BindingDB:
Activity Spreadsheet -- Enzyme Inhibition Constant Data from BindingDB
Found 1 hit for monomerid = 160835
TargetInterleukin-2(Homo sapiens (Human))
Rigel Pharmaceuticals
US Patent
LigandPNGBDBM160835(US9682976, 6)
Affinity DataEC50: <500nM. Assay description: Primary T cell stimulation and IL2 ELISA: Human primary T cells (100,000 cells per well) were pre-incubated with or without test compound in Yssel...
Ligand InfoPC cidPC sid
In DepthDetails US Patent