BDBM161056 US9108951, 17::US9394276, 17::US9725435, 17
SMILES COC(=O)Nc1cccc(NC(=O)[C@H]2N(CCc3ccccc23)C(=O)\C=C\c2cc(Cl)ccc2-n2cnnn2)c1
InChI Key InChIKey=DRCOAWZMCNGLHV-UBWSOHEKSA-N
Data  3 KI
  Tab Delimited (TSV)   2D SDfile   Computed 3D by Vconf -m prep SDfile
Find this compound or compounds like it in BindingDB:
Activity Spreadsheet -- Enzyme Inhibition Constant Data from BindingDB
Found 3 hits for monomerid = 161056
TargetCoagulation factor XI(Homo sapiens (Human))
Bristol-Myers Squibb
US Patent
LigandPNGBDBM161056(US9108951, 17 | US9394276, 17 | US9725435, 17)
Affinity DataKi:  2.80E+3nM. Assay description: The effectiveness of compounds of the present invention as inhibitors of the coagulation factors XIa, Vila, IXa, Xa, Xlla, plasma kallikrein or throm...
In DepthDetails US Patent
TargetCoagulation factor XI(Homo sapiens (Human))
Bristol-Myers Squibb
US Patent
LigandPNGBDBM161056(US9108951, 17 | US9394276, 17 | US9725435, 17)
Affinity DataKi:  2.80E+3nM. Assay description: Factor XIa determinations were made in 50 mM HEPES buffer at pH 7.4 containing 145 mM NaCl, 5 mM KCl, and 0.1% PEG 8000 (polyethylene glycol; JT Bake...
In DepthDetails US Patent
TargetCoagulation factor XI(Homo sapiens (Human))
Bristol-Myers Squibb
US Patent
LigandPNGBDBM161056(US9108951, 17 | US9394276, 17 | US9725435, 17)
Affinity DataKi:  2.80E+3nMpH: 7.4Assay Description:Factor XIa determinations were made in 50 mM HEPES buffer at pH 7.4 containing 145 mM NaCl, 5 mM KCl, and 0.1% PEG 8000 (polyethylene glycol; JT Bake...
In DepthDetails US Patent