BDBM161406 US10124003, Ex. Compound 19::US10835536, Ex. Comp 19::US10894048, Ex Comp 19::US9108973, 19
SMILES COc1cc(OC)cc(c1)C#Cc1nn(C2CN(C2)C(=O)\C=C\CN(C)C(C)C)c2ncnc(N)c12
InChI Key InChIKey=LNPBBXKKNPLOKX-VOTSOKGWSA-N
Data  4 IC50
  Tab Delimited (TSV)   2D SDfile   Computed 3D by Vconf -m prep SDfile
Find this compound or compounds like it in BindingDB:
Activity Spreadsheet -- Enzyme Inhibition Constant Data from BindingDB
Found 4 hits for monomerid = 161406
TargetFibroblast growth factor receptor 2(Homo sapiens (Human))
Taiho Pharmaceutical
US Patent
LigandPNGBDBM161406(US10124003, Ex. Compound 19 | US10835536, Ex. Comp...)
Affinity DataIC50:  2.70nMpH: 7.5 T: 2°C. Assay description: When setting conditions for the measurement of the inhibitory effect of the compounds on FGFR2 kinase activity, FL-Peptide 22 (Caliper Life Sciences,...
In DepthDetails US Patent
TargetFibroblast growth factor receptor 2(Homo sapiens (Human))
Taiho Pharmaceutical
US Patent
LigandPNGBDBM161406(US10124003, Ex. Compound 19 | US10835536, Ex. Comp...)
Affinity DataIC50:  2.70nM. Assay description: When setting conditions for the measurement of the inhibitory effect of the compounds on FGFR2 kinase activity, FL-Peptide 22 (Caliper Life Sciences,...
In DepthDetails US Patent
TargetFibroblast growth factor receptor 2(Homo sapiens (Human))
Taiho Pharmaceutical
US Patent
LigandPNGBDBM161406(US10124003, Ex. Compound 19 | US10835536, Ex. Comp...)
Affinity DataIC50:  2.70nM. Assay description: When setting conditions for the measurement of the inhibitory effect of the compounds on FGFR2 kinase activity, FL-Peptide 22 (Caliper Life Sciences,...
In DepthDetails US Patent
TargetFibroblast growth factor receptor 2(Homo sapiens (Human))
Taiho Pharmaceutical
US Patent
LigandPNGBDBM161406(US10124003, Ex. Compound 19 | US10835536, Ex. Comp...)
Affinity DataIC50:  2.70nM. Assay description: When setting conditions for the measurement of the inhibitory effect of the compounds on FGFR2 kinase activity, FL-Peptide 22 (Caliper Life Sciences,...
In DepthDetails US Patent