BDBM161426 US10124003, Ex. Compound 39::US10894048, Ex Comp 39::US9108973, 39::US9108973, 73
SMILES COc1cc(OC)cc(c1)C#Cc1cn([C@H]2CCN(C2)C(=O)C=C)c2ncnc(N)c12
InChI Key InChIKey=WNLKWKSWBHLZFM-KRWDZBQOSA-N
Data  4 IC50
  Tab Delimited (TSV)   2D SDfile   Computed 3D by Vconf -m prep SDfile
Find this compound or compounds like it in BindingDB:
Activity Spreadsheet -- Enzyme Inhibition Constant Data from BindingDB
Found 4 hits for monomerid = 161426
TargetFibroblast growth factor receptor 2(Homo sapiens (Human))
Taiho Pharmaceutical
US Patent
LigandPNGBDBM161426(US10124003, Ex. Compound 39 | US10894048, Ex Comp ...)
Affinity DataIC50:  0.400nMpH: 7.5 T: 2°C. Assay description: When setting conditions for the measurement of the inhibitory effect of the compounds on FGFR2 kinase activity, FL-Peptide 22 (Caliper Life Sciences,...
In DepthDetails US Patent
TargetFibroblast growth factor receptor 2(Homo sapiens (Human))
Taiho Pharmaceutical
US Patent
LigandPNGBDBM161426(US10124003, Ex. Compound 39 | US10894048, Ex Comp ...)
Affinity DataIC50:  0.400nM. Assay description: When setting conditions for the measurement of the inhibitory effect of the compounds on FGFR2 kinase activity, FL-Peptide 22 (Caliper Life Sciences,...
In DepthDetails US Patent
TargetFibroblast growth factor receptor 2(Homo sapiens (Human))
Taiho Pharmaceutical
US Patent
LigandPNGBDBM161426(US10124003, Ex. Compound 39 | US10894048, Ex Comp ...)
Affinity DataIC50:  0.400nM. Assay description: When setting conditions for the measurement of the inhibitory effect of the compounds on FGFR2 kinase activity, FL-Peptide 22 (Caliper Life Sciences,...
In DepthDetails US Patent
TargetFibroblast growth factor receptor 2(Homo sapiens (Human))
Taiho Pharmaceutical
US Patent
LigandPNGBDBM161426(US10124003, Ex. Compound 39 | US10894048, Ex Comp ...)
Affinity DataIC50:  4.90nMpH: 7.5 T: 2°C. Assay description: When setting conditions for the measurement of the inhibitory effect of the compounds on FGFR2 kinase activity, FL-Peptide 22 (Caliper Life Sciences,...
In DepthDetails US Patent