BDBM161435 US10124003, Ex. Compound 49::US10835536, Ex. Comp 49::US10894048, Ex Comp 48::US9108973, 48
SMILES COc1cc(OC)cc(c1)C#Cc1cn([C@H]2CCN(C2)C(=O)\C=C\CN2CC[C@@H](F)C2)c2ncnc(N)c12
InChI Key InChIKey=HUQYNBRBASHDJY-DTDVHRGSSA-N
Data  6 IC50
  Tab Delimited (TSV)   2D SDfile   Computed 3D by Vconf -m prep SDfile
Find this compound or compounds like it in BindingDB:
Activity Spreadsheet -- Enzyme Inhibition Constant Data from BindingDB
Found 6 hits for monomerid = 161435
TargetFibroblast growth factor receptor 2(Homo sapiens (Human))
Taiho Pharmaceutical
US Patent
LigandPNGBDBM161435(US10124003, Ex. Compound 49 | US10835536, Ex. Comp...)
Affinity DataIC50:  6.80nMpH: 7.5 T: 2°C. Assay description: When setting conditions for the measurement of the inhibitory effect of the compounds on FGFR2 kinase activity, FL-Peptide 22 (Caliper Life Sciences,...
In DepthDetails US Patent
TargetFibroblast growth factor receptor 2(Homo sapiens (Human))
Taiho Pharmaceutical
US Patent
LigandPNGBDBM161435(US10124003, Ex. Compound 49 | US10835536, Ex. Comp...)
Affinity DataIC50:  6.80nM. Assay description: When setting conditions for the measurement of the inhibitory effect of the compounds on FGFR2 kinase activity, FL-Peptide 22 (Caliper Life Sciences,...
In DepthDetails US Patent
TargetFibroblast growth factor receptor 2(Homo sapiens (Human))
Taiho Pharmaceutical
US Patent
LigandPNGBDBM161435(US10124003, Ex. Compound 49 | US10835536, Ex. Comp...)
Affinity DataIC50:  6.80nM. Assay description: When setting conditions for the measurement of the inhibitory effect of the compounds on FGFR2 kinase activity, FL-Peptide 22 (Caliper Life Sciences,...
In DepthDetails US Patent
TargetFibroblast growth factor receptor 2(Homo sapiens (Human))
Taiho Pharmaceutical
US Patent
LigandPNGBDBM161435(US10124003, Ex. Compound 49 | US10835536, Ex. Comp...)
Affinity DataIC50:  6.80nM. Assay description: When setting conditions for the measurement of the inhibitory effect of the compounds on FGFR2 kinase activity, FL-Peptide 22 (Caliper Life Sciences,...
In DepthDetails US Patent
TargetFibroblast growth factor receptor 2(Homo sapiens (Human))
Taiho Pharmaceutical
US Patent
LigandPNGBDBM161435(US10124003, Ex. Compound 49 | US10835536, Ex. Comp...)
Affinity DataIC50:  7nM. Assay description: When setting conditions for the measurement of the inhibitory effect of the compounds on FGFR2 kinase activity, FL-Peptide 22 (Caliper Life Sciences,...
In DepthDetails US Patent
TargetFibroblast growth factor receptor 2(Homo sapiens (Human))
Taiho Pharmaceutical
US Patent
LigandPNGBDBM161435(US10124003, Ex. Compound 49 | US10835536, Ex. Comp...)
Affinity DataIC50:  7nM. Assay description: When setting conditions for the measurement of the inhibitory effect of the compounds on FGFR2 kinase activity, FL-Peptide 22 (Caliper Life Sciences,...
In DepthDetails US Patent