BDBM161852 US9682976, 284
SMILES COc1ccc(Nc2ncc(F)c(N[C@@H]3C[C@@H]4CCCN4C(C)(C)C3)n2)cc1-n1nnnc1OC1COC1
InChI Key InChIKey=OBOIQQBQMJFUJD-SJORKVTESA-N
Data  1 EC50
  Tab Delimited (TSV)   2D SDfile   Computed 3D by Vconf -m prep SDfile
Find this compound or compounds like it in BindingDB:
Activity Spreadsheet -- Enzyme Inhibition Constant Data from BindingDB
Found 1 hit for monomerid = 161852
TargetInterleukin-2(Homo sapiens (Human))
Rigel Pharmaceuticals
US Patent
LigandPNGBDBM161852(US9682976, 284)
Affinity DataEC50: <100nM. Assay description: Primary T cell stimulation and IL2 ELISA: Human primary T cells (100,000 cells per well) were pre-incubated with or without test compound in Yssel...
Ligand InfoPC cidPC sid
In DepthDetails US Patent