BDBM162051 US9682991, 47
SMILES CN1CCOc2c(NC3CCNCC3)nn3c(nnc3c12)-c1cccc(OC(F)(F)F)c1
InChI Key InChIKey=SNHUZUAIZJFYDK-UHFFFAOYSA-N
Data  2 IC50
  Tab Delimited (TSV)   2D SDfile   Computed 3D by Vconf -m prep SDfile
Find this compound or compounds like it in BindingDB:
Activity Spreadsheet -- Enzyme Inhibition Constant Data from BindingDB
Found 2 hits for monomerid = 162051
TargetSerine/threonine-protein kinase pim-2(Homo sapiens (Human))
FundaciÓN Centro Nacional De Investigaciones Oncologicas Carlos Iii
US Patent
LigandPNGBDBM162051(US9682991, 47)
Affinity DataIC50: >1.00E+3nM. Assay description: The biochemical assay to measure PIM-2 activity relies on the ADP Hunter assay kit (DiscoveRx Corp., Cat. #90-0077), that determines the amount of AD...
Ligand InfoPC cidPC sid
In DepthDetails US Patent
TargetSerine/threonine-protein kinase pim-1(Homo sapiens (Human))
FundaciÓN Centro Nacional De Investigaciones Oncologicas Carlos Iii
US Patent
LigandPNGBDBM162051(US9682991, 47)
Affinity DataIC50:  550nM. Assay description: The biochemical assay to measure PIM-1 activity relies on the ADP Hunter assay kit (DiscoveRx Corp., Cat. #90-0077), that determines the amount of AD...
Ligand InfoPC cidPC sid
In DepthDetails US Patent