BDBM162701 US9056836, 22
SMILES COc1ccc2C[C@@H]3[C@H](CO)[C@](CC(N)=O)(CCN3CC3CC3)c2c1
InChI Key InChIKey=OILWGVPRTMIIFX-NSHGMRRFSA-N
Data  1 KI
  Tab Delimited (TSV)   2D SDfile   Computed 3D by Vconf -m prep SDfile
Find this compound or compounds like it in BindingDB:
Activity Spreadsheet -- Enzyme Inhibition Constant Data from BindingDB
Found 1 hit for monomerid = 162701
TargetKappa-type opioid receptor(Homo sapiens (Human))
Purdue Pharma
US Patent
LigandPNGBDBM162701(US9056836, 22)
Affinity DataKi:  79.1nM ΔG°:  -9.68kcal/molepH: 7.4 T: 2°C. Assay description: Radioligand dose displacement assays used 0.4 nM [3]-U69,593 (GE Healthcare, Piscataway, N.J.; 40 Ci/mmole) with 15 ug membrane protein (recombinant ...
In DepthDetails US Patent