BDBM163041 US9062004, 4::US9670216, 4 4-Chloro-5-dimethylamino-2-(3,3,5,5-tetramethylcyclohexyl)pyridazin-3-one
SMILES CN(C)c1cnn(C2CC(C)(C)CC(C)(C)C2)c(=O)c1Cl
InChI Key InChIKey=GJTFBGFCXVODMT-UHFFFAOYSA-N
Data  4 IC50
  Tab Delimited (TSV)   2D SDfile   Computed 3D by Vconf -m prep SDfile
Find this compound or compounds like it in BindingDB:
Activity Spreadsheet -- Enzyme Inhibition Constant Data from BindingDB
Found 4 hits for monomerid = 163041
TargetCannabinoid receptor 1(Homo sapiens (Human))
Allergan
US Patent
LigandPNGBDBM163041(US9062004, 4 | US9670216, 4 4-Chloro-5-dimethylami...)
Affinity DataIC50:  1.02E+3nM. Assay description: Plasma membranes prepared from HEK 293 EBNA cells transfected with human CB1 or CB2 cannabinoid receptors (3.7 or 3.3 .mu.mol/mg protein, receptor co...
In DepthDetails US Patent
TargetCannabinoid receptor 2(Homo sapiens (Human))
Allergan
US Patent
LigandPNGBDBM163041(US9062004, 4 | US9670216, 4 4-Chloro-5-dimethylami...)
Affinity DataIC50:  17nMT: 2°C. Assay description: Plasma membranes prepared from HEK 293 EBNA cells transfected with human CB1 or CB2 cannabinoid receptors (3.7 or 3.3 pmol/mg protein, receptor conce...
In DepthDetails US Patent
TargetCannabinoid receptor 1(Homo sapiens (Human))
Allergan
US Patent
LigandPNGBDBM163041(US9062004, 4 | US9670216, 4 4-Chloro-5-dimethylami...)
Affinity DataIC50:  1.02E+3nMT: 2°C. Assay description: Plasma membranes prepared from HEK 293 EBNA cells transfected with human CB1 or CB2 cannabinoid receptors (3.7 or 3.3 pmol/mg protein, receptor conce...
In DepthDetails US Patent
TargetCannabinoid receptor 2(Homo sapiens (Human))
Allergan
US Patent
LigandPNGBDBM163041(US9062004, 4 | US9670216, 4 4-Chloro-5-dimethylami...)
Affinity DataIC50:  17nM. Assay description: Plasma membranes prepared from HEK 293 EBNA cells transfected with human CB1 or CB2 cannabinoid receptors (3.7 or 3.3 .mu.mol/mg protein, receptor co...
In DepthDetails US Patent