BDBM163051 US9062004, 15::US9670216, 16 4-Chloro-2-(3,5-dimethylphenyl)-5-propylaminopyridazin-3-one
SMILES CC1(C)CC(CC(C)(C)C1)n1ncc(NCCN2CCOCC2)c(Br)c1=O
InChI Key InChIKey=LFSXWIRCSGJIBI-UHFFFAOYSA-N
Data  6 IC50
  Tab Delimited (TSV)   2D SDfile   Computed 3D by Vconf -m prep SDfile
Find this compound or compounds like it in BindingDB:
Activity Spreadsheet -- Enzyme Inhibition Constant Data from BindingDB
Found 6 hits for monomerid = 163051
TargetCannabinoid receptor 1(Homo sapiens (Human))
Allergan
US Patent
LigandPNGBDBM163051(US9062004, 15 | US9670216, 16 4-Chloro-2-(3,5-dime...)
Affinity DataIC50:  1.86E+3nM. Assay description: Plasma membranes prepared from HEK 293 EBNA cells transfected with human CB1 or CB2 cannabinoid receptors (3.7 or 3.3 .mu.mol/mg protein, receptor co...
In DepthDetails US Patent
TargetCannabinoid receptor 2(Homo sapiens (Human))
Allergan
US Patent
LigandPNGBDBM163051(US9062004, 15 | US9670216, 16 4-Chloro-2-(3,5-dime...)
Affinity DataIC50:  22.4nM. Assay description: Plasma membranes prepared from HEK 293 EBNA cells transfected with human CB1 or CB2 cannabinoid receptors (3.7 or 3.3 .mu.mol/mg protein, receptor co...
In DepthDetails US Patent
TargetCannabinoid receptor 2(Homo sapiens (Human))
Allergan
US Patent
LigandPNGBDBM163051(US9062004, 15 | US9670216, 16 4-Chloro-2-(3,5-dime...)
Affinity DataIC50:  1.00E+4nMT: 2°C. Assay description: Plasma membranes prepared from HEK 293 EBNA cells transfected with human CB1 or CB2 cannabinoid receptors (3.7 or 3.3 pmol/mg protein, receptor conce...
In DepthDetails US Patent
TargetCannabinoid receptor 2(Homo sapiens (Human))
Allergan
US Patent
LigandPNGBDBM163051(US9062004, 15 | US9670216, 16 4-Chloro-2-(3,5-dime...)
Affinity DataIC50:  22nMT: 2°C. Assay description: Plasma membranes prepared from HEK 293 EBNA cells transfected with human CB1 or CB2 cannabinoid receptors (3.7 or 3.3 pmol/mg protein, receptor conce...
In DepthDetails US Patent
TargetCannabinoid receptor 1(Homo sapiens (Human))
Allergan
US Patent
LigandPNGBDBM163051(US9062004, 15 | US9670216, 16 4-Chloro-2-(3,5-dime...)
Affinity DataIC50: >1.00E+4nMT: 2°C. Assay description: Plasma membranes prepared from HEK 293 EBNA cells transfected with human CB1 or CB2 cannabinoid receptors (3.7 or 3.3 pmol/mg protein, receptor conce...
In DepthDetails US Patent
TargetCannabinoid receptor 1(Homo sapiens (Human))
Allergan
US Patent
LigandPNGBDBM163051(US9062004, 15 | US9670216, 16 4-Chloro-2-(3,5-dime...)
Affinity DataIC50:  1.86E+3nMT: 2°C. Assay description: Plasma membranes prepared from HEK 293 EBNA cells transfected with human CB1 or CB2 cannabinoid receptors (3.7 or 3.3 pmol/mg protein, receptor conce...
In DepthDetails US Patent