BDBM164975 US9067917, 8::US9682971, 8
SMILES CC1(C)CCCC1(Cc1nc2cc(OCc3ccc4ccccc4n3)ccc2n1Cc1ccc(Br)cc1)C(O)=O
InChI Key InChIKey=XBZYTQQWHJXJQY-UHFFFAOYSA-N
Data  2 KI
  Tab Delimited (TSV)   2D SDfile   Computed 3D by Vconf -m prep SDfile
Find this compound or compounds like it in BindingDB:
Activity Spreadsheet -- Enzyme Inhibition Constant Data from BindingDB
Found 2 hits for monomerid = 164975
TargetArachidonate 5-lipoxygenase-activating protein(Homo sapiens (Human))
Janssen Pharmaceutica
US Patent
LigandPNGBDBM164975(US9067917, 8 | US9682971, 8)
Affinity DataKi:  3nM. Assay description: The assay below is used to test the modulatory activity of compounds against FLAP. Human and mouse FLAP-encoding DNA was amplified by polymerase chai...
In DepthDetails US Patent
TargetArachidonate 5-lipoxygenase-activating protein(Homo sapiens (Human))
Janssen Pharmaceutica
US Patent
LigandPNGBDBM164975(US9067917, 8 | US9682971, 8)
Affinity DataKi:  3nM. Assay description: The assay below is used to test the modulatory activity of compounds against FLAP. Human and mouse FLAP-encoding DNA was amplified by polymerase chai...
In DepthDetails US Patent