BDBM165003 US9067917, 36::US9682971, 36
SMILES OC(=O)[C@H]1CCCC[C@H]1c1nc2cc(OCc3ccc4ccccc4n3)ccc2n1Cc1ccccc1
InChI Key InChIKey=UCRUFLITADHOBH-FTJBHMTQSA-N
Data  2 KI
  Tab Delimited (TSV)   2D SDfile   Computed 3D by Vconf -m prep SDfile
Find this compound or compounds like it in BindingDB:
Activity Spreadsheet -- Enzyme Inhibition Constant Data from BindingDB
Found 2 hits for monomerid = 165003
TargetArachidonate 5-lipoxygenase-activating protein(Homo sapiens (Human))
Janssen Pharmaceutica
US Patent
LigandPNGBDBM165003(US9067917, 36 | US9682971, 36)
Affinity DataKi:  9nM. Assay description: The assay below is used to test the modulatory activity of compounds against FLAP. Human and mouse FLAP-encoding DNA was amplified by polymerase chai...
In DepthDetails US Patent
TargetArachidonate 5-lipoxygenase-activating protein(Homo sapiens (Human))
Janssen Pharmaceutica
US Patent
LigandPNGBDBM165003(US9067917, 36 | US9682971, 36)
Affinity DataKi:  9nM. Assay description: The assay below is used to test the modulatory activity of compounds against FLAP. Human and mouse FLAP-encoding DNA was amplified by polymerase chai...
In DepthDetails US Patent