BDBM165064 US9067917, 99::US9682971, 99
SMILES Cn1cc(cn1)-c1cccc(Cn2c(CC3(CCCC3)C(O)=O)nc3cc(OCc4ccc5ccccc5n4)ccc23)c1
InChI Key InChIKey=LIJGYORXMPZVRK-UHFFFAOYSA-N
Data  2 KI
  Tab Delimited (TSV)   2D SDfile   Computed 3D by Vconf -m prep SDfile
Find this compound or compounds like it in BindingDB:
Activity Spreadsheet -- Enzyme Inhibition Constant Data from BindingDB
Found 2 hits for monomerid = 165064
TargetArachidonate 5-lipoxygenase-activating protein(Homo sapiens (Human))
Janssen Pharmaceutica
US Patent
LigandPNGBDBM165064(US9067917, 99 | US9682971, 99)
Affinity DataKi:  7.5nM. Assay description: The assay below is used to test the modulatory activity of compounds against FLAP. Human and mouse FLAP-encoding DNA was amplified by polymerase chai...
In DepthDetails US Patent
TargetArachidonate 5-lipoxygenase-activating protein(Homo sapiens (Human))
Janssen Pharmaceutica
US Patent
LigandPNGBDBM165064(US9067917, 99 | US9682971, 99)
Affinity DataKi:  7.5nM. Assay description: The assay below is used to test the modulatory activity of compounds against FLAP. Human and mouse FLAP-encoding DNA was amplified by polymerase chai...
In DepthDetails US Patent