BDBM165105 US9067917, 140::US9682971, 140
SMILES OC(=O)[C@H]1CCCCC1c1nc2cc(OCc3ccc4ccccc4n3)ccc2n1Cc1ccc(cc1F)-c1ccc(cc1)C(F)(F)F
InChI Key InChIKey=HWKHQFOBYHSYCX-FLDQDSGZSA-N
Data  2 KI
  Tab Delimited (TSV)   2D SDfile   Computed 3D by Vconf -m prep SDfile
Find this compound or compounds like it in BindingDB:
Activity Spreadsheet -- Enzyme Inhibition Constant Data from BindingDB
Found 2 hits for monomerid = 165105
TargetArachidonate 5-lipoxygenase-activating protein(Homo sapiens (Human))
Janssen Pharmaceutica
US Patent
LigandPNGBDBM165105(US9067917, 140 | US9682971, 140)
Affinity DataKi:  18nM. Assay description: The assay below is used to test the modulatory activity of compounds against FLAP. Human and mouse FLAP-encoding DNA was amplified by polymerase chai...
In DepthDetails US Patent
TargetArachidonate 5-lipoxygenase-activating protein(Homo sapiens (Human))
Janssen Pharmaceutica
US Patent
LigandPNGBDBM165105(US9067917, 140 | US9682971, 140)
Affinity DataKi:  18nM. Assay description: The assay below is used to test the modulatory activity of compounds against FLAP. Human and mouse FLAP-encoding DNA was amplified by polymerase chai...
In DepthDetails US Patent