BDBM165132 US9067917, 167::US9682971, 167
SMILES CC(C)(Cc1nc2cc(OCc3ccc4ccccc4n3)ccc2n1Cc1cccc(c1)-c1cncs1)C(O)=O
InChI Key InChIKey=YNTWWFKPEMVZLD-UHFFFAOYSA-N
Data  2 KI
  Tab Delimited (TSV)   2D SDfile   Computed 3D by Vconf -m prep SDfile
Find this compound or compounds like it in BindingDB:
Activity Spreadsheet -- Enzyme Inhibition Constant Data from BindingDB
Found 2 hits for monomerid = 165132
TargetArachidonate 5-lipoxygenase-activating protein(Homo sapiens (Human))
Janssen Pharmaceutica
US Patent
LigandPNGBDBM165132(US9067917, 167 | US9682971, 167)
Affinity DataKi:  17nM. Assay description: The assay below is used to test the modulatory activity of compounds against FLAP. Human and mouse FLAP-encoding DNA was amplified by polymerase chai...
In DepthDetails US Patent
TargetArachidonate 5-lipoxygenase-activating protein(Homo sapiens (Human))
Janssen Pharmaceutica
US Patent
LigandPNGBDBM165132(US9067917, 167 | US9682971, 167)
Affinity DataKi:  17nM. Assay description: The assay below is used to test the modulatory activity of compounds against FLAP. Human and mouse FLAP-encoding DNA was amplified by polymerase chai...
In DepthDetails US Patent