BDBM165174 US9067917, 209::US9067917, 210::US9682971, 210
SMILES OC(=O)[C@@H]1CCCC[C@@H]1c1nc2cc(OCc3nc4ccccc4s3)ccc2n1Cc1ccc(Br)cc1
InChI Key InChIKey=PKOYWFOHHRGCON-FCHUYYIVSA-N
Data  4 KI
  Tab Delimited (TSV)   2D SDfile   Computed 3D by Vconf -m prep SDfile
Find this compound or compounds like it in BindingDB:
Activity Spreadsheet -- Enzyme Inhibition Constant Data from BindingDB
Found 4 hits for monomerid = 165174
TargetArachidonate 5-lipoxygenase-activating protein(Homo sapiens (Human))
Janssen Pharmaceutica
US Patent
LigandPNGBDBM165174(US9067917, 209 | US9067917, 210 | US9682971, 210)
Affinity DataKi:  3.5nM. Assay description: The assay below is used to test the modulatory activity of compounds against FLAP. Human and mouse FLAP-encoding DNA was amplified by polymerase chai...
In DepthDetails US Patent
TargetArachidonate 5-lipoxygenase-activating protein(Homo sapiens (Human))
Janssen Pharmaceutica
US Patent
LigandPNGBDBM165174(US9067917, 209 | US9067917, 210 | US9682971, 210)
Affinity DataKi:  3.5nM. Assay description: The assay below is used to test the modulatory activity of compounds against FLAP. Human and mouse FLAP-encoding DNA was amplified by polymerase chai...
In DepthDetails US Patent
TargetArachidonate 5-lipoxygenase-activating protein(Homo sapiens (Human))
Janssen Pharmaceutica
US Patent
LigandPNGBDBM165174(US9067917, 209 | US9067917, 210 | US9682971, 210)
Affinity DataKi:  600nM. Assay description: The assay below is used to test the modulatory activity of compounds against FLAP. Human and mouse FLAP-encoding DNA was amplified by polymerase chai...
In DepthDetails US Patent
TargetArachidonate 5-lipoxygenase-activating protein(Homo sapiens (Human))
Janssen Pharmaceutica
US Patent
LigandPNGBDBM165174(US9067917, 209 | US9067917, 210 | US9682971, 210)
Affinity DataKi:  600nM. Assay description: The assay below is used to test the modulatory activity of compounds against FLAP. Human and mouse FLAP-encoding DNA was amplified by polymerase chai...
In DepthDetails US Patent