BDBM16535 (3E)-5-{5-[(2S)-2-amino-3-phenylpropoxy]pyridin-3-yl}-3-(furan-2-ylmethylidene)-2,3-dihydro-1H-indol-2-one::(S)-5-(5-(2-Amino-3-phenylpropoxy)pyridin-3-yl)-3-(furan-2-ylmethylene)indolin-2-one::oxindole-pyridine, 36
SMILES N[C@H](COc1cncc(c1)-c1ccc2NC(=O)\C(=C\c3ccco3)c2c1)Cc1ccccc1
InChI Key InChIKey=RHOXUCVDAMLMFG-NFCNUSAFSA-N
Data  1 IC50
  Tab Delimited (TSV)   2D SDfile   Computed 3D by Vconf -m prep SDfile
Find this compound or compounds like it in BindingDB:
Activity Spreadsheet -- Enzyme Inhibition Constant Data from BindingDB
Found 1 hit for monomerid = 16535
LigandPNGBDBM16535((3E)-5-{5-[(2S)-2-amino-3-phenylpropoxy]pyridin-3-...)
Affinity DataIC50:  1.40nMpH: 7.5 T: 2°C. Assay description: The kinase assay uses His-Akt1 and a biotinylated peptide as substrate. The biotinylated peptides were immobilized on streptavidin-coated FLASH plat...
In DepthDetails ArticlePubMed