BDBM16569 (2S)-1-[6-fluoro-3-(trifluoromethyl)phenyl]-3-{[5-(3-methyl-1H-indazol-5-yl)pyridin-3-yl]oxy}propan-2-amine::5-{5-[(2S)-2-amino-3-[2-fluoro-5-(trifluoromethyl)phenyl]propoxy]pyridin-3-yl}-3-methyl-1H-indazole::indazole-pyridine, 13ah
SMILES Cc1n[nH]c2ccc(cc12)-c1cncc(OC[C@@H](N)Cc2cc(ccc2F)C(F)(F)F)c1
InChI Key InChIKey=CIYJMYQAULVQHO-SFHVURJKSA-N
Data  1 IC50
  Tab Delimited (TSV)   2D SDfile   Computed 3D by Vconf -m prep SDfile
Find this compound or compounds like it in BindingDB:
Activity Spreadsheet -- Enzyme Inhibition Constant Data from BindingDB
Found 1 hit for monomerid = 16569
LigandPNGBDBM16569((2S)-1-[6-fluoro-3-(trifluoromethyl)phenyl]-3-{[5-...)
Affinity DataIC50:  1.20nM. Assay description: The kinase assay uses His-Akt1 and a biotinylated peptide as substrate. The biotinylated peptides were immobilized on streptavidin-coated FLASH plat...
In DepthDetails ArticlePubMed