BDBM166460 US9073853, 19
SMILES COc1cc(CN(C[C@H]2CC[C@@H](CC2)C(O)=O)C(C)c2ccc3OCCc3c2)ccc1OCCN1C(=O)COC1=O
InChI Key InChIKey=OJEDZZCXTIFZHQ-WRZFRPBISA-N
Data  2 IC50
  Tab Delimited (TSV)   2D SDfile   Computed 3D by Vconf -m prep SDfile
Find this compound or compounds like it in BindingDB:
Activity Spreadsheet -- Enzyme Inhibition Constant Data from BindingDB
Found 2 hits for monomerid = 166460
TargetC-X-C chemokine receptor type 3(Homo sapiens (Human))
Sanofi
Curated by ChEMBL
LigandPNGBDBM166460(US9073853, 19)
Affinity DataIC50:  55nM. Assay description: Displacement of [125I]-CXCL10 from human recombinant CXCR3 transfected in Flp-In-CHO cell membranes after 60 mins by gamma counting method
Ligand InfoPC cidPC sid
In DepthDetails ArticlePubMed
TargetC-X-C chemokine receptor type 3(Homo sapiens (Human))
Sanofi
Curated by ChEMBL
LigandPNGBDBM166460(US9073853, 19)
Affinity DataIC50:  55nM. Assay description: Competition radioligand binding assays were performed to determine the in vitro potency of the newly synthesized, unlabeled test compounds to displac...
Ligand InfoPC cidPC sid
In DepthDetails US Patent