BDBM167056 US9073876, 142::US9732093, Compound 142
SMILES COCc1cc(Oc2c(F)c(ccc2C2CCC2)-c2cnc(N)cn2)nc(N)n1
InChI Key InChIKey=OXVYCYSTQBYTIO-UHFFFAOYSA-N
Data  3 KI
  Tab Delimited (TSV)   2D SDfile   Computed 3D by Vconf -m prep SDfile
Find this compound or compounds like it in BindingDB:
Activity Spreadsheet -- Enzyme Inhibition Constant Data from BindingDB
Found 2 hits for monomerid = 167056
TargetFlap endonuclease 1(Homo sapiens (Human))
Janssen Pharmaceutica
US Patent
LigandPNGBDBM167056(US9073876, 142 | US9732093, Compound 142)
Affinity DataKi:  1.70nM. Assay description: The assay below is used to test the modulatory activity of compounds against FLAP. Human and mouse FLAP-encoding DNA was amplified by polymerase chai...
In DepthDetails US Patent
TargetFlap endonuclease 1(Homo sapiens (Human))
Janssen Pharmaceutica
US Patent
LigandPNGBDBM167056(US9073876, 142 | US9732093, Compound 142)
Affinity DataKi:  1.70nM. Assay description: The assay below is used to test the modulatory activity of compounds against FLAP. Human and mouse FLAP-encoding DNA was amplified by polymerase chai...
In DepthDetails US Patent