BDBM168292 US9669031, 120 8′-chloro-2,2-dimethyl-6′-(pyrimidin-4-ylamino)-2′H-spiro[cyclobutane-1,3′-imidazo[1,5-a]pyridine]-1′,5′-dione (Cpd. No. 120)
SMILES CC1(C)CCC11NC(=O)c2c(Cl)cc(Nc3ccncn3)c(=O)n12
InChI Key InChIKey=PRCYWYOEZGQIEL-UHFFFAOYSA-N
Data  1 IC50
  Tab Delimited (TSV)   2D SDfile   Computed 3D by Vconf -m prep SDfile
Find this compound or compounds like it in BindingDB:
Activity Spreadsheet -- Enzyme Inhibition Constant Data from BindingDB
Found 1 hit for monomerid = 168292
TargetMAP kinase-interacting serine/threonine-protein kinase 2(Homo sapiens (Human))
Effector Therapeutics
US Patent
LigandPNGBDBM168292(US9669031, 120 8′-chloro-2,2-dimethyl-6̸...)
Affinity DataIC50: <10nMT: 2°C. Assay description: Compounds are screened for Mnk inhibition using the ADP-Glo kinase assay kit (Promega, catalogue No. V9101). All kinase reactions are performed in Re...
Ligand InfoPC cidPC sid
In DepthDetails US Patent