BDBM168425 US9669034, 37 (rac)-Ethyl[(3-{[4-(2,3-dihydro-1,4-benzodioxin-5-yl)-1,3,5-triazin-2-yl]amino}benzyl)(methyl)oxide-λ6-sulfanylidene]carbamate
SMILES CCOC(=O)N=S(C)(=O)Cc1cccc(Nc2ncnc(n2)-c2cccc3OCCOc23)c1
InChI Key InChIKey=HSNCIMRSYIDBOX-UHFFFAOYSA-N
Data  2 IC50
  Tab Delimited (TSV)   2D SDfile   Computed 3D by Vconf -m prep SDfile
Find this compound or compounds like it in BindingDB:
Activity Spreadsheet -- Enzyme Inhibition Constant Data from BindingDB
Found 2 hits for monomerid = 168425
TargetCyclin-dependent kinase 2/G1/S-specific cyclin-E1(Homo sapiens (Human))
Bayer Intellectual Property
US Patent
LigandPNGBDBM168425(US9669034, 37 (rac)-Ethyl[(3-{[4-(2,3-dihydro-1,4-...)
Affinity DataIC50:  2.30E+3nMpH: 8.0 T: 2°C. Assay description: For the assay 50 nl of a 100 fold concentrated solution of the test compound in DMSO was pipetted into a black low volume 384 well microtiter plate (...
Ligand InfoPC cidPC sid
In DepthDetails US Patent
TargetCyclin-T1/Cyclin-dependent kinase 9(Homo sapiens (Human))
Bayer Intellectual Property
US Patent
LigandPNGBDBM168425(US9669034, 37 (rac)-Ethyl[(3-{[4-(2,3-dihydro-1,4-...)
Affinity DataIC50:  9nMpH: 8.0 T: 2°C. Assay description: For the assay 50 nl of a 100 fold concentrated solution of the test compound in DMSO was pipetted into a black low volume 384 well microtiter plate (...
Ligand InfoPC cidPC sid
In DepthDetails US Patent